Reaction Details
TargetKappa-type opioid receptor
LigandBDBM50199896
Substrate/Competitorn/a
Meas. Tech.ChEMBL_422423 (CHEMBL909299)
Ki 9±n/a nM
Citation Le Bourdonnec, BGoodman, AJGraczyk, TMBelanger, SSeida, PRDeHaven, RNDolle, RE Synthesis and pharmacological evaluation of novel octahydro-1H-pyrido[1,2-a]pyrazine as mu-opioid receptor antagonists. J Med Chem49:7290-306 (2006) 
 
Kappa-type opioid receptor
Name:Kappa-type opioid receptor
Type:G Protein-Coupled Receptor (GPCR)
Mol. Mass.:42648.76
Organism:Homo sapiens (Human)
Description:P41145
Residue:380
BDBM50199896
NameBDBM50199896
Synonyms:3-((2R,3R,7S,9-alpha-S)-2,3-dimethyl-7-phenyl-octahydro-1H-quinolizin-2-yl)phenol CHEMBL426523 | US8580788, 56
TypeSmall organic molecule
Emp. Form.C23H29NO
Mol. Mass.335.4825
SMILESC[C@H]1CN2C[C@@H](CC[C@H]2C[C@@]1(C)c1cccc(O)c1)c1ccccc1