Reaction Details
TargetMu-type opioid receptor
LigandBDBM50000788
Substrate/Competitorn/a
Meas. Tech.ChEMBL_422422 (CHEMBL909298)
IC50 7.3±n/a nM
Citation Le Bourdonnec, BGoodman, AJGraczyk, TMBelanger, SSeida, PRDeHaven, RNDolle, RE Synthesis and pharmacological evaluation of novel octahydro-1H-pyrido[1,2-a]pyrazine as mu-opioid receptor antagonists. J Med Chem49:7290-306 (2006) 
 
Mu-type opioid receptor
Name:Mu-type opioid receptor
Type:G Protein-Coupled Receptor (GPCR)
Mol. Mass.:44789.51
Organism:Homo sapiens (Human)
Description:P35372
Residue:400
BDBM50000788
NameBDBM50000788
Synonyms:(morphine)4-methyl-(1S,5R,13R,14S,17R)-12-oxa-4-azapentacyclo[9.6.1.01,13.05,17.07,18]octadeca-7(18),8,10,15-tetraene-10,14-diol (naloxone)4-allyl-10,17-dihydroxy-(1S,5R,13R,17S)-12-oxa-4-azapentacyclo[9.6.1.01,13.05,17.07,18]octadeca-7(18),8,10-trien-14-one 4-allyl-10,17-dihydroxy-(1S,5R,13R,17S)-12-oxa-4-azapentacyclo[9.6.1.01,13.05,17.07,18]octadeca-7(18),8,10-trien-14-one 4-allyl-10,17-dihydroxy-(1S,5R,13R,17S)-12-oxa-4-azapentacyclo[9.6.1.01,13.05,17.07,18]octadeca-7(18),8,10-trien-14-one( Naloxone) 4-allyl-10,17-dihydroxy-12-oxa-4-azapentacyclo[9.6.1.01,13.05,17.07,18]octadeca-7(18),8,10-trien-14-one Analog of 14-(Arylhydroxyamino)codeinone NARCAN [17-(2,3-3H-2-propenyl)]-4, 5a -epoxy-3,14-dihydroxymorphinan-6-one
TypeSmall organic molecule
Emp. Form.C19H21NO4
Mol. Mass.327.3743
SMILESOc1ccc2C[C@H]3N(CC=C)CC[C@@]45[C@@H](Oc1c24)C(=O)CC[C@@]35O