Reaction Details
TargetMu-type opioid receptor
LigandBDBM60212
Substrate/Competitorn/a
Meas. Tech.ChEMBL_422443 (CHEMBL909317)
IC50 4.1±n/a nM
Citation Le Bourdonnec, BGoodman, AJMichaut, MYe, HFGraczyk, TMBelanger, SHerbertz, TYap, GPDeHaven, RNDolle, RE Elucidation of the bioactive conformation of the N-substituted trans-3,4-dimethyl-4-(3-hydroxyphenyl)piperidine class of mu-opioid receptor antagonists. J Med Chem49:7278-89 (2006) 
 
Mu-type opioid receptor
Name:Mu-type opioid receptor
Type:G Protein-Coupled Receptor (GPCR)
Mol. Mass.:44789.51
Organism:Homo sapiens (Human)
Description:P35372
Residue:400
BDBM60212
NameBDBM60212
Synonyms:(4R,4aS,7aR,12bS)-3-(cyclopropylmethyl)-4a,9-bis(oxidanyl)-2,4,5,6,7a,13-hexahydro-1H-4,12-methanobenzofuro[3,2-e]isoquinoline-7-one;hydrochloride MLS000069607 SMR000058767 US9107954, naltrexone | cid_5485201
TypeSmall organic molecule
Emp. Form.C20H23NO4
Mol. Mass.341.4009
SMILESOc1ccc2C[C@H]3N(CC4CC4)CC[C@@]45[C@@H](Oc1c24)C(=O)CC[C@@]35O