Reaction Details
TargetDelta-type opioid receptor
LigandBDBM50045767
Substrate/Competitorn/a
Meas. Tech.ChEMBL_422439 (CHEMBL908255)
Ki 33±n/a nM
Citation Le Bourdonnec, BGoodman, AJMichaut, MYe, HFGraczyk, TMBelanger, SHerbertz, TYap, GPDeHaven, RNDolle, RE Elucidation of the bioactive conformation of the N-substituted trans-3,4-dimethyl-4-(3-hydroxyphenyl)piperidine class of mu-opioid receptor antagonists. J Med Chem49:7278-89 (2006) 
 
Delta-type opioid receptor
Name:Delta-type opioid receptor
Type:G Protein-Coupled Receptor (GPCR)
Mol. Mass.:40382.98
Organism:Homo sapiens (Human)
Description:Competition binding assays were carried out using membrane preparations from transfected HN9.10 cells that constitutively expressed the delta opioid receptor.
Residue:372
BDBM50045767
NameBDBM50045767
Synonyms:(+)-N-phenethyl trans-3(R),4(R)-dimethyl-4-(3-hydroxyphenyl)piperidine 3-(3,4-Dimethyl-1-phenethyl-piperidin-4-yl)-phenol CHEMBL319536 | N-phenethyltrans-3,4-dimethyl-4-(3-hydroxyphenyl)piperidine
TypeSmall organic molecule
Emp. Form.C21H27NO
Mol. Mass.309.4452
SMILESC[C@H]1CN(CCc2ccccc2)CC[C@@]1(C)c1cccc(O)c1