Reaction Details
TargetKappa-type opioid receptor
LigandBDBM50199893
Substrate/Competitorn/a
Meas. Tech.ChEMBL_422446 (CHEMBL909320)
Ki 69±n/a nM
Citation Le Bourdonnec, BGoodman, AJMichaut, MYe, HFGraczyk, TMBelanger, SHerbertz, TYap, GPDeHaven, RNDolle, RE Elucidation of the bioactive conformation of the N-substituted trans-3,4-dimethyl-4-(3-hydroxyphenyl)piperidine class of mu-opioid receptor antagonists. J Med Chem49:7278-89 (2006) 
 
Kappa-type opioid receptor
Name:Kappa-type opioid receptor
Type:G Protein-Coupled Receptor (GPCR)
Mol. Mass.:42648.76
Organism:Homo sapiens (Human)
Description:P41145
Residue:380
BDBM50199893
NameBDBM50199893
Synonyms:3-((1R,2R,9-alpha-S)-1,2-dimethyl-octahydro-1H-quinolizin-2-yl)phenol | CHEMBL219012
TypeSmall organic molecule
Emp. Form.C17H25NO
Mol. Mass.259.3865
SMILESC[C@H]1[C@@H]2CCCCN2CC[C@@]1(C)c1cccc(O)c1