Reaction Details
TargetMu-type opioid receptor
LigandBDBM50199896
Substrate/Competitorn/a
Meas. Tech.ChEMBL_422443 (CHEMBL909317)
IC50 0.540000±n/a nM
Citation Le Bourdonnec, BGoodman, AJMichaut, MYe, HFGraczyk, TMBelanger, SHerbertz, TYap, GPDeHaven, RNDolle, RE Elucidation of the bioactive conformation of the N-substituted trans-3,4-dimethyl-4-(3-hydroxyphenyl)piperidine class of mu-opioid receptor antagonists. J Med Chem49:7278-89 (2006) 
 
Mu-type opioid receptor
Name:Mu-type opioid receptor
Type:G Protein-Coupled Receptor (GPCR)
Mol. Mass.:44789.51
Organism:Homo sapiens (Human)
Description:P35372
Residue:400
BDBM50199896
NameBDBM50199896
Synonyms:3-((2R,3R,7S,9-alpha-S)-2,3-dimethyl-7-phenyl-octahydro-1H-quinolizin-2-yl)phenol CHEMBL426523 | US8580788, 56
TypeSmall organic molecule
Emp. Form.C23H29NO
Mol. Mass.335.4825
SMILESC[C@H]1CN2C[C@@H](CC[C@H]2C[C@@]1(C)c1cccc(O)c1)c1ccccc1