Reaction Details
TargetPituitary adenylate cyclase-activating polypeptide type I receptor
LigandBDBM50200209
Substrate/Competitorn/a
Meas. Tech.ChEMBL_422596 (CHEMBL911645)
IC50 3±n/a nM
Citation Clairmont, KBBuckholz, TMPellegrino, CMBuxton, JMBarucci, NBell, AHa, SLi, FClaus, THSalhanick, AILumb, KJ Engineering of a VPAC2 receptor peptide agonist to impart dipeptidyl peptidase IV stability and enhance in vivo glucose disposal. J Med Chem49:7545-8 (2006) 
 
Pituitary adenylate cyclase-activating polypeptide type I receptor
Name:Pituitary adenylate cyclase-activating polypeptide type I receptor
Type:PROTEIN
Mol. Mass.:53307.50
Organism:Homo sapiens (Human)
Description:ChEMBL_498617
Residue:468
BDBM50200209
NameBDBM50200209
Synonyms:CHEMBL219499
TypeSmall organic molecule
Emp. Form.C142H223N39O40S
Mol. Mass.3148.592
SMILESCC[C@H](C)[C@H](NC(=O)CNC(=O)[C@H](CC(O)=O)NC(=O)[C@H](CO)NC(=O)[C@@H](N)Cc1cnc[nH]1)C(=O)N[C@@H](Cc1ccccc1)C(=O)N[C@@H]([C@@H](C)O)C(=O)N[C@@H](CC(O)=O)C(=O)N[C@@H](CO)C(=O)N[C@@H](Cc1ccc(O)cc1)C(=O)N[C@@H](CO)C(=O)N[C@@H](CCCN=C(N)N)C(=O)N[C@@H](Cc1ccc(O)cc1)C(=O)N[C@@H](CCCN=C(N)N)C(=O)N[C@@H](CCCCN)C(=O)N[C@@H](CCC(N)=O)C(=O)N[C@@H](CCSC)C(=O)N[C@@H](C)C(=O)N[C@@H](C(C)C)C(=O)N[C@@H](CCCCN)C(=O)N[C@@H](CCCCN)C(=O)N[C@@H](Cc1ccc(O)cc1)C(=O)N[C@@H](CC(C)C)C(=O)N[C@@H](C)C(=O)N[C@@H](C)C(=O)N[C@@H](C(C)C)C(=O)N[C@@H](CC(C)C)C(O)=O