Reaction Details
TargetPeptide deformylase
LigandBDBM50201875
Substrate/Competitorn/a
Meas. Tech.ChEMBL_423229 (CHEMBL913367)
IC50 9000±n/a nM
Citation Boularot, AGiglione, CPetit, SDuroc, YAlves de Sousa, RLarue, VCresteil, TDardel, FArtaud, IMeinnel, T Discovery and refinement of a new structural class of potent peptide deformylase inhibitors. J Med Chem50:10-20 (2007) 
 
Peptide deformylase
Name:Peptide deformylase
Type:n/a
Mol. Mass.:16901.39
Organism:Escherichia coli
Description:n/a
Residue:150
BDBM50201875
NameBDBM50201875
Synonyms:2-(5-methoxy-1H-indol-3-yl)-N-hydroxyacetamide | CHEMBL219859
TypeSmall organic molecule
Emp. Form.C12H14N2O3
Mol. Mass.234.2512
SMILESCOc1ccc2[nH]cc(CC(=O)CNO)c2c1