Reaction Details
TargetPeptide deformylase, mitochondrial
LigandBDBM50201873
Substrate/Competitorn/a
Meas. Tech.ChEMBL_423227 (CHEMBL912248)
IC50 250000±n/a nM
Citation Boularot, AGiglione, CPetit, SDuroc, YAlves de Sousa, RLarue, VCresteil, TDardel, FArtaud, IMeinnel, T Discovery and refinement of a new structural class of potent peptide deformylase inhibitors. J Med Chem50:10-20 (2007) 
 
Peptide deformylase, mitochondrial
Name:Peptide deformylase, mitochondrial
Type:PROTEIN
Mol. Mass.:27023.25
Organism:Homo sapiens (Human)
Description:ChEMBL_154318
Residue:243
BDBM50201873
NameBDBM50201873
Synonyms:2-(6-bromo-1H-indol-3-yl)-N-hydroxyacetamide | CHEMBL219438
TypeSmall organic molecule
Emp. Form.C11H11BrN2O2
Mol. Mass.283.121
SMILESONCC(=O)Cc1c[nH]c2cc(Br)ccc12