Reaction Details
TargetPeptide deformylase, mitochondrial
LigandBDBM50201876
Substrate/Competitorn/a
Meas. Tech.ChEMBL_423227 (CHEMBL912248)
IC50 600000±n/a nM
Citation Boularot, AGiglione, CPetit, SDuroc, YAlves de Sousa, RLarue, VCresteil, TDardel, FArtaud, IMeinnel, T Discovery and refinement of a new structural class of potent peptide deformylase inhibitors. J Med Chem50:10-20 (2007) 
 
Peptide deformylase, mitochondrial
Name:Peptide deformylase, mitochondrial
Type:PROTEIN
Mol. Mass.:27023.25
Organism:Homo sapiens (Human)
Description:ChEMBL_154318
Residue:243
BDBM50201876
NameBDBM50201876
Synonyms:2-(5-chloro-1H-indol-3-yl)-N-hydroxyacetamide | CHEMBL373863
TypeSmall organic molecule
Emp. Form.C11H11ClN2O2
Mol. Mass.238.67
SMILESONCC(=O)Cc1c[nH]c2ccc(Cl)cc12