Reaction Details
TargetPeptide deformylase
LigandBDBM50201877
Substrate/Competitorn/a
Meas. Tech.ChEMBL_423229 (CHEMBL913367)
IC50 160±n/a nM
Citation Boularot, AGiglione, CPetit, SDuroc, YAlves de Sousa, RLarue, VCresteil, TDardel, FArtaud, IMeinnel, T Discovery and refinement of a new structural class of potent peptide deformylase inhibitors. J Med Chem50:10-20 (2007) 
 
Peptide deformylase
Name:Peptide deformylase
Type:n/a
Mol. Mass.:16901.39
Organism:Escherichia coli
Description:n/a
Residue:150
BDBM50201877
NameBDBM50201877
Synonyms:2-(5-fluoro-1H-indol-3-yl)-N-hydroxyacetamide | CHEMBL219858
TypeSmall organic molecule
Emp. Form.C11H11FN2O2
Mol. Mass.222.2156
SMILESONCC(=O)Cc1c[nH]c2ccc(F)cc12