Reaction Details
TargetPeptide deformylase 1A, chloroplastic/mitochondrial
LigandBDBM50089194
Substrate/Competitorn/a
Meas. Tech.ChEMBL_423228 (CHEMBL912247)
IC50 27±n/a nM
Citation Boularot, AGiglione, CPetit, SDuroc, YAlves de Sousa, RLarue, VCresteil, TDardel, FArtaud, IMeinnel, T Discovery and refinement of a new structural class of potent peptide deformylase inhibitors. J Med Chem50:10-20 (2007) 
 
Peptide deformylase 1A, chloroplastic/mitochondrial
Name:Peptide deformylase 1A, chloroplastic/mitochondrial
Type:PROTEIN
Mol. Mass.:30001.50
Organism:Arabidopsis thaliana
Description:ChEMBL_423228
Residue:269
BDBM50089194
NameBDBM50089194
Synonyms:(R)-N*4*-Hydroxy-N*1*-[(S)-1-((S)-2-hydroxymethyl-pyrrolidine-1-carbonyl)-2-methyl-propyl]-2-pentyl-succinamide ACTINONIN N*4*-Hydroxy-N*1*-[(S)-1-((S)-2-hydroxymethyl-pyrrolidine-1-carbonyl)-2-methyl-propyl]-2-(R)-pentyl-succinamide | N*4*-Hydroxy-N*1*-[1-(2-hydroxymethyl-pyrrolidine-1-carbonyl)-2-methyl-propyl]-2-pentyl-succinamide
TypeSmall organic molecule
Emp. Form.C19H35N3O5
Mol. Mass.385.4983
SMILESCCCCC[C@H](CC(=O)NO)C(=O)N[C@@H](C(C)C)C(=O)N1CCC[C@H]1CO