Reaction Details
TargetPeptide deformylase
LigandBDBM50201883
Substrate/Competitorn/a
Meas. Tech.ChEMBL_423229 (CHEMBL913367)
IC50>1000000±n/a nM
Citation Boularot, AGiglione, CPetit, SDuroc, YAlves de Sousa, RLarue, VCresteil, TDardel, FArtaud, IMeinnel, T Discovery and refinement of a new structural class of potent peptide deformylase inhibitors. J Med Chem50:10-20 (2007) 
 
Peptide deformylase
Name:Peptide deformylase
Type:n/a
Mol. Mass.:16901.39
Organism:Escherichia coli
Description:n/a
Residue:150
BDBM50201883
NameBDBM50201883
Synonyms:(indol-3-yl)acetic acid 2-(indol-3-yl)ethanoic acid Acid, 6 IAA heteroauxin | indole-3-acetic acid
TypeSmall organic molecule
Emp. Form.C10H9NO2
Mol. Mass.175.184
SMILESOC(=O)Cc1c[nH]c2ccccc12