Reaction Details
TargetPeptide deformylase
LigandBDBM50201881
Substrate/Competitorn/a
Meas. Tech.ChEMBL_423229 (CHEMBL913367)
IC50 50±n/a nM
Citation Boularot, AGiglione, CPetit, SDuroc, YAlves de Sousa, RLarue, VCresteil, TDardel, FArtaud, IMeinnel, T Discovery and refinement of a new structural class of potent peptide deformylase inhibitors. J Med Chem50:10-20 (2007) 
 
Peptide deformylase
Name:Peptide deformylase
Type:n/a
Mol. Mass.:16901.39
Organism:Escherichia coli
Description:n/a
Residue:150
BDBM50201881
NameBDBM50201881
Synonyms:(1-hydroxycarbamoylmethyl-2-phenylethyl)carbamic acidtert-butyl ester | CHEMBL220470
TypeSmall organic molecule
Emp. Form.C15H22N2O4
Mol. Mass.294.3462
SMILESCC(C)(C)OC(=O)NC(CN(O)C=O)Cc1ccccc1