Reaction Details
TargetPeptide deformylase
LigandBDBM50201880
Substrate/Competitorn/a
Meas. Tech.ChEMBL_423229 (CHEMBL913367)
IC50 52000±n/a nM
Citation Boularot, AGiglione, CPetit, SDuroc, YAlves de Sousa, RLarue, VCresteil, TDardel, FArtaud, IMeinnel, T Discovery and refinement of a new structural class of potent peptide deformylase inhibitors. J Med Chem50:10-20 (2007) 
 
Peptide deformylase
Name:Peptide deformylase
Type:n/a
Mol. Mass.:16901.39
Organism:Escherichia coli
Description:n/a
Residue:150
BDBM50201880
NameBDBM50201880
Synonyms:(1-hydroxyaminomethyl-2-phenylethyl)carbamic acid tert-butyl ester | CHEMBL218925
TypeSmall organic molecule
Emp. Form.C14H22N2O3
Mol. Mass.266.3361
SMILESCC(C)(C)OC(=O)NC(CNO)Cc1ccccc1