Reaction Details
TargetPeptide deformylase
LigandBDBM50201890
Substrate/Competitorn/a
Meas. Tech.ChEMBL_423229 (CHEMBL913367)
IC50 560000±n/a nM
Citation Boularot, AGiglione, CPetit, SDuroc, YAlves de Sousa, RLarue, VCresteil, TDardel, FArtaud, IMeinnel, T Discovery and refinement of a new structural class of potent peptide deformylase inhibitors. J Med Chem50:10-20 (2007) 
 
Peptide deformylase
Name:Peptide deformylase
Type:n/a
Mol. Mass.:16901.39
Organism:Escherichia coli
Description:n/a
Residue:150
BDBM50201890
NameBDBM50201890
Synonyms:1-(5-bromo-1H-indol-3-yl)-3-hydroxypropan-2-one | CHEMBL219296
TypeSmall organic molecule
Emp. Form.C11H10BrNO2
Mol. Mass.268.107
SMILESOCC(=O)Cc1c[nH]c2ccc(Br)cc12