Reaction Details
TargetPeptide deformylase
LigandBDBM50201889
Substrate/Competitorn/a
Meas. Tech.ChEMBL_423229 (CHEMBL913367)
IC50 380000±n/a nM
Citation Boularot, AGiglione, CPetit, SDuroc, YAlves de Sousa, RLarue, VCresteil, TDardel, FArtaud, IMeinnel, T Discovery and refinement of a new structural class of potent peptide deformylase inhibitors. J Med Chem50:10-20 (2007) 
 
Peptide deformylase
Name:Peptide deformylase
Type:n/a
Mol. Mass.:16901.39
Organism:Escherichia coli
Description:n/a
Residue:150
BDBM50201889
NameBDBM50201889
Synonyms:(5-Bromo-1H-indol-3-yl)-acetic acid CHEMBL82440
TypeSmall organic molecule
Emp. Form.C10H8BrNO2
Mol. Mass.254.08
SMILESOC(=O)Cc1c[nH]c2ccc(Br)cc12