Reaction Details
TargetPeptide deformylase
LigandBDBM50201888
Substrate/Competitorn/a
Meas. Tech.ChEMBL_423229 (CHEMBL913367)
IC50 44±n/a nM
Citation Boularot, AGiglione, CPetit, SDuroc, YAlves de Sousa, RLarue, VCresteil, TDardel, FArtaud, IMeinnel, T Discovery and refinement of a new structural class of potent peptide deformylase inhibitors. J Med Chem50:10-20 (2007) 
 
Peptide deformylase
Name:Peptide deformylase
Type:n/a
Mol. Mass.:16901.39
Organism:Escherichia coli
Description:n/a
Residue:150
BDBM50201888
NameBDBM50201888
Synonyms:(1-hydroxycarbamoylmethyl-2-phenylethyl)carbamic acid tert-butyl ester | CHEMBL218819
TypeSmall organic molecule
Emp. Form.C15H22N2O4
Mol. Mass.294.3462
SMILESCC(C)(C)OC(=O)NC(CC(=O)NO)Cc1ccccc1