Reaction Details
TargetPeptide deformylase
LigandBDBM50201869
Substrate/Competitorn/a
Meas. Tech.ChEMBL_423229 (CHEMBL913367)
IC50 120000±n/a nM
Citation Boularot, AGiglione, CPetit, SDuroc, YAlves de Sousa, RLarue, VCresteil, TDardel, FArtaud, IMeinnel, T Discovery and refinement of a new structural class of potent peptide deformylase inhibitors. J Med Chem50:10-20 (2007) 
 
Peptide deformylase
Name:Peptide deformylase
Type:n/a
Mol. Mass.:16901.39
Organism:Escherichia coli
Description:n/a
Residue:150
BDBM50201869
NameBDBM50201869
Synonyms:CHEMBL376222 | thioacetic acid S-[3-(5-bromo-1H-indol-3-yl)-2-oxopropyl]ester
TypeSmall organic molecule
Emp. Form.C13H12BrNO2S
Mol. Mass.326.209
SMILESCC(=O)SCC(=O)Cc1c[nH]c2ccc(Br)cc12