Reaction Details
TargetPeptide deformylase, mitochondrial
LigandBDBM50201878
Substrate/Competitorn/a
Meas. Tech.ChEMBL_423227 (CHEMBL912248)
IC50 200000±n/a nM
Citation Boularot, AGiglione, CPetit, SDuroc, YAlves de Sousa, RLarue, VCresteil, TDardel, FArtaud, IMeinnel, T Discovery and refinement of a new structural class of potent peptide deformylase inhibitors. J Med Chem50:10-20 (2007) 
 
Peptide deformylase, mitochondrial
Name:Peptide deformylase, mitochondrial
Type:PROTEIN
Mol. Mass.:27023.25
Organism:Homo sapiens (Human)
Description:ChEMBL_154318
Residue:243
BDBM50201878
NameBDBM50201878
Synonyms:CHEMBL220027 | N-(1-benzenesulfonyl-5-bromo-2-methyl-1H-indol-3-ylmethyl)-N-hydroxyformamide
TypeSmall organic molecule
Emp. Form.C17H15BrN2O4S
Mol. Mass.423.281
SMILESCc1c(CN(O)C=O)c2cc(Br)ccc2n1S(=O)(=O)c1ccccc1