Reaction Details
TargetSodium-dependent dopamine transporter
LigandBDBM50202389
Substrate/Competitorn/a
Meas. Tech.ChEMBL_423467 (CHEMBL911118)
Ki 9.4±n/a nM
Citation Froimowitz, MGu, YDakin, LANagafuji, PMKelley, CJParrish, DDeschamps, JRJanowsky, A Slow-onset, long-duration, alkyl analogues of methylphenidate with enhanced selectivity for the dopamine transporter. J Med Chem50:219-32 (2007) 
 
Sodium-dependent dopamine transporter
Name:Sodium-dependent dopamine transporter
Type:Multi-pass membrane protein
Mol. Mass.:68497.11
Organism:Homo sapiens (Human)
Description:Q01959
Residue:620
BDBM50202389
NameBDBM50202389
Synonyms:(RR/SS)-2-[1-(4-chlorophenyl)-2-cyclopentylethyl]-piperidine CHEMBL219653
TypeSmall organic molecule
Emp. Form.C18H26ClN
Mol. Mass.291.859
SMILESClc1ccc(cc1)C(CC1CCCC1)C1CCCCN1