Reaction Details
TargetSodium-dependent dopamine transporter
LigandBDBM50202381
Substrate/Competitorn/a
Meas. Tech.ChEMBL_423467 (CHEMBL911118)
Ki 16±n/a nM
Citation Froimowitz, MGu, YDakin, LANagafuji, PMKelley, CJParrish, DDeschamps, JRJanowsky, A Slow-onset, long-duration, alkyl analogues of methylphenidate with enhanced selectivity for the dopamine transporter. J Med Chem50:219-32 (2007) 
 
Sodium-dependent dopamine transporter
Name:Sodium-dependent dopamine transporter
Type:Multi-pass membrane protein
Mol. Mass.:68497.11
Organism:Homo sapiens (Human)
Description:Q01959
Residue:620
BDBM50202381
NameBDBM50202381
Synonyms:(RR/SS)-2-[1-(4-chlorophenyl)-3-methylbutyl]piperodine CHEMBL220247
TypeSmall organic molecule
Emp. Form.C16H24ClN
Mol. Mass.265.821
SMILESCC(C)CC(C1CCCCN1)c1ccc(Cl)cc1