Reaction Details
TargetSodium-dependent noradrenaline transporter
LigandBDBM50202391
Substrate/Competitorn/a
Meas. Tech.ChEMBL_423471 (CHEMBL911128)
Ki 14±n/a nM
Citation Froimowitz, MGu, YDakin, LANagafuji, PMKelley, CJParrish, DDeschamps, JRJanowsky, A Slow-onset, long-duration, alkyl analogues of methylphenidate with enhanced selectivity for the dopamine transporter. J Med Chem50:219-32 (2007) 
 
Sodium-dependent noradrenaline transporter
Name:Sodium-dependent noradrenaline transporter
Type:Multi-pass membrane protein
Mol. Mass.:69337.72
Organism:Homo sapiens (Human)
Description:P23975
Residue:617
BDBM50202391
NameBDBM50202391
Synonyms:(RS/SR)-methyl 2-(3,4-dichlorophenyl)-2-(piperidin-2-yl)acetate methyl 2-(3,4-dichlorophenyl)-2-(piperidin-2-yl)acetate
TypeSmall organic molecule
Emp. Form.C14H17Cl2NO2
Mol. Mass.302.196
SMILESCOC(=O)C(C1CCCCN1)c1ccc(Cl)c(Cl)c1