Reaction Details
TargetCarbonic anhydrase 9
LigandBDBM10879
Substrate/Competitorn/a
Meas. Tech.ChEMBL_423835 (CHEMBL911286)
Ki 176±n/a nM
Citation Nishimori, IMinakuchi, TOnishi, SVullo, DScozzafava, ASupuran, CT Carbonic anhydrase inhibitors. DNA cloning, characterization, and inhibition studies of the human secretory isoform VI, a new target for sulfonamide and sulfamate inhibitors. J Med Chem50:381-8 (2007) 
 
Carbonic anhydrase 9
Name:Carbonic anhydrase 9
Type:Enzyme
Mol. Mass.:49669.03
Organism:Homo sapiens (Human)
Description:Catalytic domain of human cloned isozyme was used in the assay
Residue:459
BDBM10879
NameBDBM10879
Synonyms:2-Hydrazinobenzenesulfonamide CHEMBL176495 hydrazide deriv. 18
TypeSmall organic molecule
Emp. Form.C6H9N3O2S
Mol. Mass.187.22
SMILESNNc1ccccc1S(N)(=O)=O