Reaction Details
TargetCarbonic anhydrase 6
LigandBDBM10861
Substrate/Competitorn/a
Meas. Tech.ChEMBL_423832 (CHEMBL911283)
Ki 813±n/a nM
Citation Nishimori, IMinakuchi, TOnishi, SVullo, DScozzafava, ASupuran, CT Carbonic anhydrase inhibitors. DNA cloning, characterization, and inhibition studies of the human secretory isoform VI, a new target for sulfonamide and sulfamate inhibitors. J Med Chem50:381-8 (2007) 
 
Carbonic anhydrase 6
Name:Carbonic anhydrase 6
Type:Enzyme
Mol. Mass.:35371.40
Organism:Homo sapiens (Human)
Description:P23280
Residue:308
BDBM10861
NameBDBM10861
Synonyms:4-(2-aminoethyl)benzene-1-sulfonamide aromatic sulfonamide compound 7 | aromatic/heteroaromatic sulfonamide 6
TypeSmall organic molecule
Emp. Form.C8H12N2O2S
Mol. Mass.200.258
SMILESNCCc1ccc(cc1)S(N)(=O)=O