Reaction Details
TargetCarbonic anhydrase 1
LigandBDBM10860
Substrate/Competitorn/a
Meas. Tech.ChEMBL_423833 (CHEMBL911284)
Ki 25000±n/a nM
Citation Nishimori, IMinakuchi, TOnishi, SVullo, DScozzafava, ASupuran, CT Carbonic anhydrase inhibitors. DNA cloning, characterization, and inhibition studies of the human secretory isoform VI, a new target for sulfonamide and sulfamate inhibitors. J Med Chem50:381-8 (2007) 
 
Carbonic anhydrase 1
Name:Carbonic anhydrase 1
Type:Enzyme
Mol. Mass.:28873.37
Organism:Homo sapiens (Human)
Description:P00915
Residue:261
BDBM10860
NameBDBM10860
Synonyms:4-(aminomethyl)benzene-1-sulfonamide MAFENIDE aromatic/heteroaromatic sulfonamide 5 | hCA inhibitor, 9
TypeSmall organic molecule
Emp. Form.C7H10N2O2S
Mol. Mass.186.232
SMILESNCc1ccc(cc1)S(N)(=O)=O