Reaction Details
TargetTyrosine-protein kinase JAK3
LigandBDBM50193995
Substrate/Competitorn/a
Meas. Tech.ChEMBL_424265 (CHEMBL908417)
IC50 13±n/a nM
Citation Chen, JJThakur, KDClark, MPLaughlin, SKGeorge, KMBookland, RGDavis, JRCabrera, EJEaswaran, VDe, BGeorge Zhang, Y Development of pyrimidine-based inhibitors of Janus tyrosine kinase 3. Bioorg Med Chem Lett16:5633-8 (2006) 
 
Tyrosine-protein kinase JAK3
Name:Tyrosine-protein kinase JAK3
Type:Protein
Mol. Mass.:125111.08
Organism:Homo sapiens (Human)
Description:P52333
Residue:1124
BDBM50193995
NameBDBM50193995
Synonyms:3-((3R,4R)-4-methyl-3-(methyl(7H-pyrrolo[2,3-d]pyrimidin-4-yl)amino)piperidin-1-yl)-3-oxopropanenitrile 3-{(3R,4R)-4-methyl-3-[methyl(7H-pyrrolo[2,3-d]pyrimidin-4-yl)amino]piperidin-1-yl}-3-oxopropanenitrile CP-690550 Tofacitinib US10112907, Example 00035 US10766894, Compound TABLE 1.20 US11078206, Example Tofacitinib US11339167, Example Tofacitinib
TypeSmall organic molecule
Emp. Form.C16H20N6O
Mol. Mass.312.3696
SMILESC[C@@H]1CCN(C[C@@H]1N(C)c1ncnc2[nH]ccc12)C(=O)CC#N