Reaction Details
TargetEnoyl-[acyl-carrier-protein] reductase [NADH] FabI
LigandBDBM50042949
Substrate/Competitorn/a
Meas. Tech.ChEMBL_425610 (CHEMBL910786)
IC50 30000±n/a nM
Citation Sharma, SKParasuraman, PKumar, GSurolia, NSurolia, A Green tea catechins potentiate triclosan binding to enoyl-ACP reductase from Plasmodium falciparum (PfENR). J Med Chem50:765-75 (2007) 
 
Enoyl-[acyl-carrier-protein] reductase [NADH] FabI
Name:Enoyl-[acyl-carrier-protein] reductase [NADH] FabI
Type:Enzyme
Mol. Mass.:27861.12
Organism:Escherichia coli
Description:n/a
Residue:262
BDBM50042949
NameBDBM50042949
Synonyms:(E)-1-(2,4-dihydroxyphenyl)-3-(3,4-dihydroxyphenyl)-2-propen-1-one (21) (E)-3-(3,4-Dihydroxy-phenyl)-1-(2,4-dihydroxy-phenyl)-propenone 3-(3,4-Dihydroxy-phenyl)-1-(2,4-dihydroxy-phenyl)-propenone CHEMBL128000
TypeSmall organic molecule
Emp. Form.C15H12O5
Mol. Mass.272.2528
SMILESOc1ccc(C(=O)\C=C\c2ccc(O)c(O)c2)c(O)c1