Reaction Details
TargetOxytocin receptor
LigandBDBM50205291
Substrate/Competitorn/a
Meas. Tech.ChEMBL_425927 (CHEMBL907382)
Ki 0.97±n/a nM
Citation Pena, AMurat, BTrueba, MVentura, MAWo, NCSzeto, HHCheng, LLStoev, SGuillon, GManning, M Design and synthesis of the first selective agonists for the rat vasopressin V(1b) receptor: based on modifications of deamino-[Cys1]arginine vasopressin at positions 4 and 8. J Med Chem50:835-47 (2007) 
 
Oxytocin receptor
Name:Oxytocin receptor
Type:Enzyme Catalytic Domain
Mol. Mass.:42889.28
Organism:RAT
Description:Oxytocin OXTR RAT::P70536
Residue:388
BDBM50205291
NameBDBM50205291
Synonyms:(S)-1-((4R,7S,10S,13S,16S)-7-(2-amino-2-oxoethyl)-10-(3-amino-3-oxopropyl)-13-benzyl-16-(4-hydroxybenzyl)-6,9,12,15,18-pentaoxo-1,2-dithia-5,8,11,14,17-pentaazacycloicosane-4-carbonyl)-N-((S)-1-(2-amino-2-oxoethylamino)-5-guanidino-1-oxopentan-2-yl)pyrrolidine-2-carboxamide deamino-[Cys1]arginine vasopressin
TypeSmall organic molecule
Emp. Form.C46H64N14O12S2
Mol. Mass.1069.217
SMILES[#7]-[#6](=O)-[#6]-[#6]-[#6@@H]-1-[#7]-[#6](=O)-[#6@H](-[#6]-c2ccccc2)-[#7]-[#6](=O)-[#6@H](-[#6]-c2ccc(-[#8])cc2)-[#7]-[#6](=O)-[#6]-[#6]-[#16]-[#16]-[#6]-[#6@H](-[#7]-[#6](=O)-[#6@H](-[#6]-[#6](-[#7])=O)-[#7]-[#6]-1=O)-[#6](=O)-[#7]-1-[#6]-[#6]-[#6]-[#6@H]-1-[#6](=O)-[#7]-[#6@@H](-[#6]-[#6]-[#6]\[#7]=[#6](\[#7])-[#7])-[#6](=O)-[#7]-[#6]-[#6](-[#7])=O