Reaction Details
TargetTranslocator protein
LigandBDBM50122293
Substrate/Competitorn/a
Meas. Tech.ChEMBL_425937 (CHEMBL906334)
IC50 1.3±n/a nM
Citation Zhang, MRKumata, KMaeda, JHaradahira, TNoguchi, JSuhara, THalldin, CSuzuki, K N-(5-Fluoro-2-phenoxyphenyl)-N-(2-[(131)I]iodo-5-me thoxybenzyl)acetamide: a potent iodinated radioligand for the peripheral-type benzodiazepine receptor in brain. J Med Chem50:848-55 (2007) 
 
Translocator protein
Name:Translocator protein
Type:Mitochondrion membrane protein
Mol. Mass.:18945.84
Organism:Rattus norvegicus (rat)
Description:Competitive binding experiments were performed on rat kidney mitochondrial membranes.
Residue:169
BDBM50122293
NameBDBM50122293
Synonyms:CHEMBL401000 N-(2,5-Dimethoxy-benzyl)-N-(5-fluoro-2-phenoxy-phenyl)-acetamide N-(2,5-dimethoxybenzyl)-N-(5-fluoro-2-phenoxyphenyl)acetamide
TypeSmall organic molecule
Emp. Form.C23H22FNO4
Mol. Mass.395.4235
SMILESCOc1ccc(OC)c(CN(C(C)=O)c2cc(F)ccc2Oc2ccccc2)c1