Reaction Details
TargetLiver carboxylesterase 1
LigandBDBM50204478
Substrate/Competitorn/a
Meas. Tech.ChEMBL_428057 (CHEMBL914371)
IC50 2000±n/a nM
Citation Romero, FADu, WHwang, IRayl, TJKimball, FSLeung, DHoover, HSApodaca, RLBreitenbucher, JGCravatt, BFBoger, DL Potent and selective alpha-ketoheterocycle-based inhibitors of the anandamide and oleamide catabolizing enzyme, fatty acid amide hydrolase. J Med Chem50:1058-68 (2007) 
 
Liver carboxylesterase 1
Name:Liver carboxylesterase 1
Type:Protein
Mol. Mass.:62520.83
Organism:Homo sapiens (Human)
Description:n/a
Residue:567
BDBM50204478
NameBDBM50204478
Synonyms:1-(5-(4-methylpyridin-2-yl)oxazol-2-yl)-7-phenylheptan-1-one | CHEMBL219658
TypeSmall organic molecule
Emp. Form.C22H24N2O2
Mol. Mass.348.4382
SMILESCc1ccnc(c1)-c1cnc(o1)C(=O)CCCCCCc1ccccc1