Reaction Details
TargetFatty-acid amide hydrolase 1
LigandBDBM50204478
Substrate/Competitorn/a
Meas. Tech.ChEMBL_428054 (CHEMBL914372)
IC50 1±n/a nM
Citation Romero, FADu, WHwang, IRayl, TJKimball, FSLeung, DHoover, HSApodaca, RLBreitenbucher, JGCravatt, BFBoger, DL Potent and selective alpha-ketoheterocycle-based inhibitors of the anandamide and oleamide catabolizing enzyme, fatty acid amide hydrolase. J Med Chem50:1058-68 (2007) 
 
Fatty-acid amide hydrolase 1
Name:Fatty-acid amide hydrolase 1
Type:Protein
Mol. Mass.:63071.19
Organism:Homo sapiens (Human)
Description:O00519
Residue:579
BDBM50204478
NameBDBM50204478
Synonyms:1-(5-(4-methylpyridin-2-yl)oxazol-2-yl)-7-phenylheptan-1-one | CHEMBL219658
TypeSmall organic molecule
Emp. Form.C22H24N2O2
Mol. Mass.348.4382
SMILESCc1ccnc(c1)-c1cnc(o1)C(=O)CCCCCCc1ccccc1