Reaction Details
TargetFatty-acid amide hydrolase 1
LigandBDBM50204514
Substrate/Competitorn/a
Meas. Tech.ChEMBL_428054 (CHEMBL914372)
Ki 10±n/a nM
Citation Romero, FADu, WHwang, IRayl, TJKimball, FSLeung, DHoover, HSApodaca, RLBreitenbucher, JGCravatt, BFBoger, DL Potent and selective alpha-ketoheterocycle-based inhibitors of the anandamide and oleamide catabolizing enzyme, fatty acid amide hydrolase. J Med Chem50:1058-68 (2007) 
 
Fatty-acid amide hydrolase 1
Name:Fatty-acid amide hydrolase 1
Type:Protein
Mol. Mass.:63071.19
Organism:Homo sapiens (Human)
Description:O00519
Residue:579
BDBM50204514
NameBDBM50204514
Synonyms:4-(2-(7-phenylheptanoyl)oxazol-5-yl)benzenesulfonamide | CHEMBL220571
TypeSmall organic molecule
Emp. Form.C22H24N2O4S
Mol. Mass.412.502
SMILESNS(=O)(=O)c1ccc(cc1)-c1cnc(o1)C(=O)CCCCCCc1ccccc1