Reaction Details
TargetFatty-acid amide hydrolase 1
LigandBDBM50400834
Substrate/Competitorn/a
Meas. Tech.ChEMBL_428054 (CHEMBL914372)
Ki 6±n/a nM
Citation Romero, FADu, WHwang, IRayl, TJKimball, FSLeung, DHoover, HSApodaca, RLBreitenbucher, JGCravatt, BFBoger, DL Potent and selective alpha-ketoheterocycle-based inhibitors of the anandamide and oleamide catabolizing enzyme, fatty acid amide hydrolase. J Med Chem50:1058-68 (2007) 
 
Fatty-acid amide hydrolase 1
Name:Fatty-acid amide hydrolase 1
Type:Protein
Mol. Mass.:63071.19
Organism:Homo sapiens (Human)
Description:O00519
Residue:579
BDBM50400834
NameBDBM50400834
Synonyms:CHEMBL220727
TypeSmall organic molecule
Emp. Form.C17H19NO3
Mol. Mass.285.3377
SMILESO=Cc1cnc(o1)C(=O)CCCCCCc1ccccc1