Reaction Details
TargetFatty-acid amide hydrolase 1
LigandBDBM50204524
Substrate/Competitorn/a
Meas. Tech.ChEMBL_428054 (CHEMBL914372)
Ki 8±n/a nM
Citation Romero, FADu, WHwang, IRayl, TJKimball, FSLeung, DHoover, HSApodaca, RLBreitenbucher, JGCravatt, BFBoger, DL Potent and selective alpha-ketoheterocycle-based inhibitors of the anandamide and oleamide catabolizing enzyme, fatty acid amide hydrolase. J Med Chem50:1058-68 (2007) 
 
Fatty-acid amide hydrolase 1
Name:Fatty-acid amide hydrolase 1
Type:Protein
Mol. Mass.:63071.19
Organism:Homo sapiens (Human)
Description:O00519
Residue:579
BDBM50204524
NameBDBM50204524
Synonyms:7-phenyl-1-(5-(piperidine-1-carbonyl)oxazol-2-yl)heptan-1-one | CHEMBL376417
TypeSmall organic molecule
Emp. Form.C22H28N2O3
Mol. Mass.368.4693
SMILESO=C(CCCCCCc1ccccc1)c1ncc(o1)C(=O)N1CCCCC1