Reaction Details
TargetATP-dependent translocase ABCB1
LigandBDBM50207970
Substrate/Competitorn/a
Meas. Tech.ChEMBL_429163 (CHEMBL914418)
EC50 40±n/a nM
Citation Kaiser, DTerfloth, LKopp, SSchulz, Jde Laet, RChiba, PEcker, GFGasteiger, J Self-organizing maps for identification of new inhibitors of P-glycoprotein. J Med Chem50:1698-702 (2007) 
 
ATP-dependent translocase ABCB1
Name:ATP-dependent translocase ABCB1
Type:Protein
Mol. Mass.:141503.50
Organism:Homo sapiens (Human)
Description:P08183
Residue:1280
BDBM50207970
NameBDBM50207970
Synonyms:3-(4-(dimethylamino)phenyl)-1-(2-(2-hydroxy-3-(4-o-tolylpiperazin-1-yl)propoxy)-4-methoxyphenyl)propan-1-one | CHEMBL374710
TypeSmall organic molecule
Emp. Form.C32H41N3O4
Mol. Mass.531.6856
SMILESCOc1ccc(C(=O)CCc2ccc(cc2)N(C)C)c(OCC(O)CN2CCN(CC2)c2ccccc2C)c1