Reaction Details
TargetSodium-dependent noradrenaline transporter
LigandBDBM50006774
Substrate/Competitorn/a
Meas. Tech.ChEMBL_429832 (CHEMBL915413)
Ki 22±n/a nM
Citation Carroll, FIRunyon, SPAbraham, PNavarro, HKuhar, MJPollard, GTHoward, JL Monoamine transporter binding, locomotor activity, and drug discrimination properties of 3-(4-substituted-phenyl)tropane-2-carboxylic acid methyl ester isomers. J Med Chem47:6401-9 (2004) 
 
Sodium-dependent noradrenaline transporter
Name:Sodium-dependent noradrenaline transporter
Type:Multi-pass membrane protein
Mol. Mass.:69337.72
Organism:Homo sapiens (Human)
Description:P23975
Residue:617
BDBM50006774
NameBDBM50006774
Synonyms:(2S,3S)-methyl 3-(4-iodophenyl)-8-methyl-8-aza-bicyclo[3.2.1]octane-2-carboxylate CHEMBL311347 | methyl 3-(4-iodophenyl)-8-methyl-(2S,3S)-8-azabicyclo[3.2.1]octane-2-carboxylate
TypeSmall organic molecule
Emp. Form.C16H20INO2
Mol. Mass.385.24
SMILESCOC(=O)[C@@H]1C2CC[C@H](C[C@@H]1c1ccc(I)cc1)N2C