Reaction Details
TargetKappa-type opioid receptor
LigandBDBM50157797
Substrate/Competitorn/a
Meas. Tech.ChEMBL_430158 (CHEMBL919067)
EC50 14±n/a nM
Citation Srivastava, SKShefali, SMiller, CNAceto, MDTraynor, JRLewis, JWHusbands, SM Effects of substitution on the pyrrole N atom in derivatives of tetrahydronaltrindole, tetrahydrooxymorphindole, and a related 4,5-epoxyphenylpyrrolomorphinan. J Med Chem47:6645-8 (2004) 
 
Kappa-type opioid receptor
Name:Kappa-type opioid receptor
Type:G Protein-Coupled Receptor (GPCR)
Mol. Mass.:42648.76
Organism:Homo sapiens (Human)
Description:P41145
Residue:380
BDBM50157797
NameBDBM50157797
Synonyms:17-cyclopropylmethyl-6-7-didehydro-3,14-dihydroxy-4,5alpha-epoxy-1'-phenylethyl-4',5',6',7'-tetrahydroindolo[2',3';6,7]morphinan | CHEMBL222762
TypeSmall organic molecule
Emp. Form.C34H38N2O3
Mol. Mass.522.6771
SMILESOc1ccc2CC3N(CC4CC4)CC[C@@]45[C@@H](Oc1c24)c1c(C[C@@]35O)c2CCCCc2n1CCc1ccccc1