Reaction Details
TargetMu-type opioid receptor
LigandBDBM50157796
Substrate/Competitorn/a
Meas. Tech.ChEMBL_430156 (CHEMBL919065)
EC50 175±n/a nM
Citation Srivastava, SKShefali, SMiller, CNAceto, MDTraynor, JRLewis, JWHusbands, SM Effects of substitution on the pyrrole N atom in derivatives of tetrahydronaltrindole, tetrahydrooxymorphindole, and a related 4,5-epoxyphenylpyrrolomorphinan. J Med Chem47:6645-8 (2004) 
 
Mu-type opioid receptor
Name:Mu-type opioid receptor
Type:G Protein-Coupled Receptor (GPCR)
Mol. Mass.:44789.51
Organism:Homo sapiens (Human)
Description:P35372
Residue:400
BDBM50157796
NameBDBM50157796
Synonyms:6,7-didehydro-3,14-dihydroxy-4,5alpha-epoxy-1'-ethyl-17-methyl-4',5',6',7'-tetrahydroindolo'2',3';6,7]morphinan | CHEMBL222704
TypeSmall organic molecule
Emp. Form.C25H30N2O3
Mol. Mass.406.5173
SMILESCCn1c2CCCCc2c2C[C@@]3(O)C4Cc5ccc(O)c6O[C@@H](c12)[C@]3(CCN4C)c56