Reaction Details
TargetKappa-type opioid receptor
LigandBDBM50157799
Substrate/Competitorn/a
Meas. Tech.ChEMBL_430158 (CHEMBL919067)
EC50 1754±n/a nM
Citation Srivastava, SKShefali, SMiller, CNAceto, MDTraynor, JRLewis, JWHusbands, SM Effects of substitution on the pyrrole N atom in derivatives of tetrahydronaltrindole, tetrahydrooxymorphindole, and a related 4,5-epoxyphenylpyrrolomorphinan. J Med Chem47:6645-8 (2004) 
 
Kappa-type opioid receptor
Name:Kappa-type opioid receptor
Type:G Protein-Coupled Receptor (GPCR)
Mol. Mass.:42648.76
Organism:Homo sapiens (Human)
Description:P41145
Residue:380
BDBM50157799
NameBDBM50157799
Synonyms:1'-benzyl-6,7-didehydro-3,14-dihydroxy-4,5alpha-epoxy-17-methyl-4',5',6',7'-tetrahydroindolo[2',3':6,7]morphinan | CHEMBL221421
TypeSmall organic molecule
Emp. Form.C30H32N2O3
Mol. Mass.468.5867
SMILESCN1CC[C@@]23[C@H]4Oc5c2c(CC1[C@]3(O)Cc1c2CCCCc2n(Cc2ccccc2)c41)ccc5O