Reaction Details
TargetThymidylate synthase
LigandBDBM18771
Substrate/Competitorn/a
Meas. Tech.ChEMBL_430602 (CHEMBL918704)
IC50 9±n/a nM
Citation Gangjee, AZeng, YMcGuire, JJMehraein, FKisliuk, RL Synthesis of classical, three-carbon-bridged 5-substituted furo[2,3-d]pyrimidine and 6-substituted pyrrolo[2,3-d]pyrimidine analogues as antifolates. J Med Chem47:6893-901 (2004) 
 
Thymidylate synthase
Name:Thymidylate synthase
Type:Enzyme
Mol. Mass.:36576.54
Organism:Lactobacillus casei
Description:n/a
Residue:316
BDBM18771
NameBDBM18771
Synonyms:(2S)-2-[(4-{[(2-amino-4-oxo-1,4-dihydroquinazolin-6-yl)methyl](prop-2-yn-1-yl)amino}phenyl)formamido]pentanedioic acid CHEMBL389051 | PDDF
TypeSmall organic molecule
Emp. Form.C24H23N5O6
Mol. Mass.477.4693
SMILESNc1nc2ccc(CN(CC#C)c3ccc(cc3)C(=O)N[C@@H](CCC(O)=O)C(O)=O)cc2c(=O)[nH]1