Reaction Details
TargetThymidylate synthase
LigandBDBM50030819
Substrate/Competitorn/a
Meas. Tech.ChEMBL_430600 (CHEMBL918702)
IC50 220000±n/a nM
Citation Gangjee, AZeng, YMcGuire, JJMehraein, FKisliuk, RL Synthesis of classical, three-carbon-bridged 5-substituted furo[2,3-d]pyrimidine and 6-substituted pyrrolo[2,3-d]pyrimidine analogues as antifolates. J Med Chem47:6893-901 (2004) 
 
Thymidylate synthase
Name:Thymidylate synthase
Type:Enzyme
Mol. Mass.:35718.07
Organism:Homo sapiens (Human)
Description:n/a
Residue:313
BDBM50030819
NameBDBM50030819
Synonyms:(S)-2-(4-(2-(2,4-diaminofuro[2,3-d]pyrimidin-5-yl)ethyl)benzamido)pentanedioic acid (S)-2-{4-[3-(2,4-Diamino-furo[2,3-d]pyrimidin-5-yl)-propyl]-benzoylamino}-pentanedioic acid CHEMBL323565 | N-[4-[2-(2,4-diaminofuro[2,3-d]pyrimidin-5-yl)ethyl]benzoyl]-L-glutamic acid
TypeSmall organic molecule
Emp. Form.C20H21N5O6
Mol. Mass.427.4106
SMILESNc1nc(N)c2c(CCc3ccc(cc3)C(=O)N[C@@H](CCC(O)=O)C(O)=O)coc2n1