Reaction Details
TargetDihydrofolate reductase
LigandBDBM50158535
Substrate/Competitorn/a
Meas. Tech.ChEMBL_430599 (CHEMBL918701)
IC50>110000±n/a nM
Citation Gangjee, AZeng, YMcGuire, JJMehraein, FKisliuk, RL Synthesis of classical, three-carbon-bridged 5-substituted furo[2,3-d]pyrimidine and 6-substituted pyrrolo[2,3-d]pyrimidine analogues as antifolates. J Med Chem47:6893-901 (2004) 
 
Dihydrofolate reductase
Name:Dihydrofolate reductase
Type:PROTEIN
Mol. Mass.:18437.08
Organism:Lactobacillus casei
Description:ChEMBL_1357878
Residue:163
BDBM50158535
NameBDBM50158535
Synonyms:CHEMBL374172 | N-{4-[3-(2-amino-3,4-dihydro-4-oxo-7H-pyrrolo[2,3-d]-pyrimidin-6-yl)propyl]benzoyl}-L-glutamic acid
TypeSmall organic molecule
Emp. Form.C21H23N5O6
Mol. Mass.441.4372
SMILESNc1nc2[nH]cc(CCCc3ccc(cc3)C(=O)N[C@@H](CCC(O)=O)C(O)=O)c2c(=O)[nH]1