Reaction Details
TargetCannabinoid receptor 2
LigandBDBM50176958
Substrate/Competitorn/a
Meas. Tech.ChEMBL_430945 (CHEMBL914887)
Ki>10000±n/a nM
Citation Brizzi, ABrizzi, VCascio, MGBisogno, TSirianni, RDi Marzo, V Design, synthesis, and binding studies of new potent ligands of cannabinoid receptors. J Med Chem48:7343-50 (2005) 
 
Cannabinoid receptor 2
Name:Cannabinoid receptor 2
Type:G Protein-Coupled Receptor (GPCR)
Mol. Mass.:39690.94
Organism:Homo sapiens (Human)
Description:P34972
Residue:360
BDBM50176958
NameBDBM50176958
Synonyms:11-(3-hydroxy-4-hexylphenoxy)undecanoic acid (4-hydroxyphenyl)amide | CHEMBL225359
TypeSmall organic molecule
Emp. Form.C29H43NO4
Mol. Mass.469.656
SMILESCCCCCCc1ccc(OCCCCCCCCCCC(=O)Nc2ccc(O)cc2)cc1O