Reaction Details
TargetCannabinoid receptor 2
LigandBDBM50176969
Substrate/Competitorn/a
Meas. Tech.ChEMBL_430945 (CHEMBL914887)
Ki 2700±n/a nM
Citation Brizzi, ABrizzi, VCascio, MGBisogno, TSirianni, RDi Marzo, V Design, synthesis, and binding studies of new potent ligands of cannabinoid receptors. J Med Chem48:7343-50 (2005) 
 
Cannabinoid receptor 2
Name:Cannabinoid receptor 2
Type:G Protein-Coupled Receptor (GPCR)
Mol. Mass.:39690.94
Organism:Homo sapiens (Human)
Description:P34972
Residue:360
BDBM50176969
NameBDBM50176969
Synonyms:11-(3-hydroxy-4-hexylphenoxy)undecanoic acid (2-hydroxyethyl)amide | CHEMBL224461
TypeSmall organic molecule
Emp. Form.C25H43NO4
Mol. Mass.421.6132
SMILESCCCCCCc1ccc(OCCCCCCCCCCC(=O)NCCO)cc1O