Reaction Details
TargetCannabinoid receptor 1
LigandBDBM50176965
Substrate/Competitorn/a
Meas. Tech.ChEMBL_430944 (CHEMBL914886)
Ki 5000±n/a nM
Citation Brizzi, ABrizzi, VCascio, MGBisogno, TSirianni, RDi Marzo, V Design, synthesis, and binding studies of new potent ligands of cannabinoid receptors. J Med Chem48:7343-50 (2005) 
 
Cannabinoid receptor 1
Name:Cannabinoid receptor 1
Type:G Protein-Coupled Receptor (GPCR)
Mol. Mass.:52868.96
Organism:Homo sapiens (Human)
Description:P21554
Residue:472
BDBM50176965
NameBDBM50176965
Synonyms:16-(3-hydroxyphenoxy)hexadecanoic acid (4-hydroxyphenyl)amide | CHEMBL224058
TypeSmall organic molecule
Emp. Form.C28H41NO4
Mol. Mass.455.6294
SMILESOc1ccc(NC(=O)CCCCCCCCCCCCCCCOc2cccc(O)c2)cc1