Reaction Details
TargetReceptor tyrosine-protein kinase erbB-2
LigandBDBM3556
Substrate/Competitorn/a
Meas. Tech.ChEMBL_431036 (CHEMBL916321)
IC50 215±n/a nM
Citation VanBrocklin, HFLim, JKCoffing, SLHom, DLNegash, KOno, MYGilmore, JLBryant, IRiese, DJ Anilinodialkoxyquinazolines: screening epidermal growth factor receptor tyrosine kinase inhibitors for potential tumor imaging probes. J Med Chem48:7445-56 (2005) 
 
Receptor tyrosine-protein kinase erbB-2
Name:Receptor tyrosine-protein kinase erbB-2
Type:n/a
Mol. Mass.:137894.47
Organism:Homo sapiens (Human)
Description:P04626
Residue:1255
BDBM3556
NameBDBM3556
Synonyms:4-[(3-Bromophenyl)amino]-6,7-diethoxyquinazoline CHEMBL35820 PD153035 Analog | PD153035 Analog 56
TypeSmall organic molecule
Emp. Form.C18H18BrN3O2
Mol. Mass.388.258
SMILESCCOc1cc2ncnc(Nc3cccc(Br)c3)c2cc1OCC