Reaction Details
TargetEpidermal growth factor receptor
LigandBDBM3556
Substrate/Competitorn/a
Meas. Tech.ChEMBL_431035 (CHEMBL916320)
IC50 3.2±n/a nM
Citation VanBrocklin, HFLim, JKCoffing, SLHom, DLNegash, KOno, MYGilmore, JLBryant, IRiese, DJ Anilinodialkoxyquinazolines: screening epidermal growth factor receptor tyrosine kinase inhibitors for potential tumor imaging probes. J Med Chem48:7445-56 (2005) 
 
Epidermal growth factor receptor
Name:Epidermal growth factor receptor
Type:Receptor Kinase Domain
Mol. Mass.:134279.59
Organism:Homo sapiens (Human)
Description:P00533
Residue:1210
BDBM3556
NameBDBM3556
Synonyms:4-[(3-Bromophenyl)amino]-6,7-diethoxyquinazoline CHEMBL35820 PD153035 Analog | PD153035 Analog 56
TypeSmall organic molecule
Emp. Form.C18H18BrN3O2
Mol. Mass.388.258
SMILESCCOc1cc2ncnc(Nc3cccc(Br)c3)c2cc1OCC