Reaction Details
TargetCannabinoid receptor 1
LigandBDBM50177156
Substrate/Competitorn/a
Meas. Tech.ChEMBL_431067 (CHEMBL917772)
Ki 2750±n/a nM
Citation Muccioli, GGWouters, JScriba, GKPoppitz, WPoupaert, JHLambert, DM 1-Benzhydryl-3-phenylurea and 1-benzhydryl-3-phenylthiourea derivatives: new templates among the CB1 cannabinoid receptor inverse agonists. J Med Chem48:7486-90 (2005) 
 
Cannabinoid receptor 1
Name:Cannabinoid receptor 1
Type:G Protein-Coupled Receptor (GPCR)
Mol. Mass.:52868.96
Organism:Homo sapiens (Human)
Description:P21554
Residue:472
BDBM50177156
NameBDBM50177156
Synonyms:5,5'-bis(4-bromophenyl)-3-(4-chlorophenyl)-2-thioxoimidazolidin-4-one | CHEMBL225003
TypeSmall organic molecule
Emp. Form.C21H13Br2ClN2OS
Mol. Mass.536.667
SMILESClc1ccc(cc1)N1C(=S)NC(C1=O)(c1ccc(Br)cc1)c1ccc(Br)cc1