Reaction Details
TargetCannabinoid receptor 1
LigandBDBM50177160
Substrate/Competitorn/a
Meas. Tech.ChEMBL_431067 (CHEMBL917772)
Ki 750±n/a nM
Citation Muccioli, GGWouters, JScriba, GKPoppitz, WPoupaert, JHLambert, DM 1-Benzhydryl-3-phenylurea and 1-benzhydryl-3-phenylthiourea derivatives: new templates among the CB1 cannabinoid receptor inverse agonists. J Med Chem48:7486-90 (2005) 
 
Cannabinoid receptor 1
Name:Cannabinoid receptor 1
Type:G Protein-Coupled Receptor (GPCR)
Mol. Mass.:52868.96
Organism:Homo sapiens (Human)
Description:P21554
Residue:472
BDBM50177160
NameBDBM50177160
Synonyms:1-[bis(4-iodophenyl)methyl]-3-(4-bromophenyl)urea | CHEMBL388398
TypeSmall organic molecule
Emp. Form.C20H15BrI2N2O
Mol. Mass.633.059
SMILESBrc1ccc(NC(=O)NC(c2ccc(I)cc2)c2ccc(I)cc2)cc1